Business News Ontology
type: Ontology
comment: The Business News Ontology describes the concepts that occur in BBC busines news
creator: Jeremy Tarling
creator: amaalmohamed
creator: jody-lan-castle-72702630
license: http://creativecommons.org/licenses/by/4.0/
canonical location: https://github.com/bbc/common-metadata/raw/master/ontologies/business.ttl
change reason: Corrected marketLocation property subproperty
slug: business
version: 0.91
public: true
imports: coreconcepts
prior version: http://www.bbc.co.uk/ontologies/business/0.9
version IRI: http://www.bbc.co.uk/ontologies/business/0.91
version info: 0.91

A company featured in BBC business news
type: Class
comment: A company featured in BBC business news, a specialisation of core:Organisation
subclass of: Organisation

A market featured in BBC business news
type: Class
comment: A market featured in BBC business news, a specialisation of core:Organisation
subclass of: Organisation

A sector featured in BBC business news
type: Class
comment: A sector featured in BBC business news, a specialisation of core:Theme
subclass of: Theme

A commodity featured in BBC business news
type: Class
comment: A commodity featured in BBC business news, a specialisation of core:Theme
subclass of: Theme

A currency featured in BBC business news
type: Class
comment: A currency featured in BBC business news, a specialisation of core:Theme
subclass of: Theme

company location
type: ObjectProperty
comment: property to associate a company with a place where it is located, registered or trades
domain: A company featured in BBC business news
range: Place
sub property of: associatedPlace

listing
type: ObjectProperty
comment: property to associate a company with an exchange where it is listed
domain: A company featured in BBC business news
range: Literal

market ticker symbol
type: DatatypeProperty
comment: literal property to associate a market its ticker symbol
domain: A market featured in BBC business news
range: Literal

parent company
type: ObjectProperty
comment: property to associate a company with a parent company
domain: A company featured in BBC business news
range: A company featured in BBC business news

sector
type: ObjectProperty
comment: property to associate a company with a sector
domain: A company featured in BBC business news
range: A sector featured in BBC business news
sub property of: notablyAssociatedWith

share ticker symbol
type: DatatypeProperty
comment: literal property to associate a share with its ticker symbol
domain: A company featured in BBC business news
range: Literal

commodity ticker symbol
type: DatatypeProperty
comment: literal property to associate a commodity with its ticker symbol
domain: A commodity featured in BBC business news
range: Literal

exchange
type: ObjectProperty
comment: property to associate a market with an exchange or stock market
domain: A market featured in BBC business news
range: Literal

memberOf
type: ObjectProperty
comment: property to associate a company with a market
domain: A company featured in BBC business news
range: A market featured in BBC business news

memberOf
type: ObjectProperty
comment: property to associate a commodity with an exchange
domain: A commodity featured in BBC business news
range: Literal

marketLocation
type: ObjectProperty
comment: property to associate a Market with a Place, most commonly a country
domain: A market featured in BBC business news
range: Place
sub property of: associatedPlace